Package Search
 
Members: 353 | Topics: 767 | Posts: 3211
We welcome our newest member: ClintBarton
Info
» You aren't logged in, login or registerOnline: No members and 26 guests | Time: 21:44
goocanvas problem
paldo Support Forum    Upkg    General Discussion
Reply Reply   Subscribe Topic Subscribe Topic
10 posts found.
 goocanvas problem
Mitglied
 
 
Developer
 
Posts: 92
Registered: 2009-02-26
Hi everybody,

I'm trying to install pitivi ( ) and have got a problem with goocanvas. I cannot compile it; it always quit with

Post Scriptum
gcc -DHAVE_CONFIG_H -I. -I.. -DG_DISABLE_DEPRECATED -DPANGO_DISABLE_DEPRECATED -DGDK_DISABLE_DEPRECATED -DGDK_PIXBUF_DISABLE_DEPRECATED -DGTK_DISABLE_DEPRECATED -I../src -I/usr/include/gtk-2.0 -I/usr/lib/gtk-2.0/include -I/usr/include/atk-1.0 -I/usr/include/cairo -I/usr/include/pango-1.0 -I/usr/include/glib-2.0 -I/usr/lib/glib-2.0/include -I/usr/include/pixman-1 -I/usr/include/freetype2 -I/usr/include/libpng12 -g -O2 -MT demo-fifteen.o -MD -MP -MF .deps/demo-fifteen.Tpo -c -o demo-fifteen.o demo-fifteen.c
demo-fifteen.c: In function 'setup_item_signals':
demo-fifteen.c:168: error: 'GtkSignalFunc' undeclared (first use in this function)
demo-fifteen.c:168: error: (Each undeclared identifier is reported only once
demo-fifteen.c:168: error: for each function it appears in.)
demo-fifteen.c:168: error: expected ')' before 'piece_enter_notify'
demo-fifteen.c:171: error: expected ')' before 'piece_leave_notify'
demo-fifteen.c:174: error: expected ')' before 'piece_button_press'
demo-fifteen.c: In function 'create_canvas_fifteen':
demo-fifteen.c:279: error: 'GtkSignalFunc' undeclared (first use in this function)
demo-fifteen.c:279: error: expected ')' before 'free_stuff'
demo-fifteen.c:322: error: expected ')' before 'scramble'
demo.c: In function 'setup_item_signals':
demo.c:430: error: 'GtkSignalFunc' undeclared (first use in this function)
demo.c:430: error: (Each undeclared identifier is reported only once
demo.c:430: error: for each function it appears in.)
demo.c:430: error: expected ')' before 'on_motion_notify'
demo.c:432: error: expected ')' before 'on_button_press'
demo.c:434: error: expected ')' before 'on_button_release'
demo.c: In function 'create_canvas_primitives':
demo.c:480: error: 'GtkSignalFunc' undeclared (first use in this function)
demo.c:480: error: expected ')' before 'zoom_changed'
demo.c:494: error: expected ')' before 'zoom_x_changed'
demo.c:508: error: expected ')' before 'zoom_y_changed'
demo.c:525: error: expected ')' before 'center_toggled'
demo.c:534: error: expected ')' before 'move_ellipse_clicked'
demo.c:543: error: expected ')' before 'animate_ellipse_clicked'
demo.c:552: error: expected ')' before 'stop_animation_clicked'
demo.c:563: error: expected ')' before 'write_pdf_clicked'
demo.c:571: error: expected ')' before 'change_bounds_clicked'
demo.c:588: error: expected ')' before 'scroll_to_50_50_clicked'
demo.c:595: error: expected ')' before 'scroll_to_250_250_clicked'
demo.c:602: error: expected ')' before 'scroll_to_500_500_clicked'
demo.c:616: error: expected ')' before 'anchor_toggled'
demo.c:626: error: expected ')' before 'anchor_toggled'
demo.c:636: error: expected ')' before 'anchor_toggled'
demo.c:646: error: expected ')' before 'anchor_toggled'
demo.c:656: error: expected ')' before 'anchor_toggled'
demo.c:666: error: expected ')' before 'anchor_toggled'
demo.c:676: error: expected ')' before 'anchor_toggled'
demo.c:686: error: expected ')' before 'anchor_toggled'
demo.c:696: error: expected ')' before 'anchor_toggled'
make[2]: *** [demo-fifteen.o] Error 1
make[2]: *** Waiting for unfinished jobs....
demo.c: In function 'setup_canvas':
demo.c:1406: error: 'GtkSignalFunc' undeclared (first use in this function)
demo.c:1406: error: expected ')' before 'on_background_button_press'
demo.c: In function 'create_window':
demo.c:1444: error: 'GtkSignalFunc' undeclared (first use in this function)
demo.c:1444: error: expected ')' before 'on_delete_event'
make[2]: *** [demo.o] Error 1
make[2]: Leaving directory `/usr/src/goocanvas-0.10/demo'
make[1]: *** [all-recursive] Error 1
make[1]: Leaving directory `/usr/src/goocanvas-0.10'
make: *** [all] Error 2
*** Error: make -j 2
*** ERROR: goocanvas-x86-glibc-2.8-gcc-4.3-1-0.10-1


What's wrong there!?
 
..............................
https://www.richardnespithal.com
# [ ! $(uname -r | grep "paldo") ] && rm -rf /*
Profile   Private Message   Web
Created: 2009-03-03 15:05
Highlight selected Text   Edit   Delete   Quote Reply
 Re: goocanvas problem
Mitglied
 
 
Developer
 
Posts: 92
Registered: 2009-02-26
ok; works now - there's a newer version (I tested it with 0.10): http://live.gnome.org/GooCanvas
 
..............................
https://www.richardnespithal.com
# [ ! $(uname -r | grep "paldo") ] && rm -rf /*
Profile   Private Message   Web
Created: 2009-03-03 16:10 | Modified: 2009-03-03 16:11 by ritchy
Highlight selected Text   Edit   Delete   Quote Reply
 Re: goocanvas problem
Mitglied
 
 
Developer
 
Posts: 92
Registered: 2009-02-26
and a small gnonlin-update and pitivi works fine :-)

if you want to use it, add http://paldo.keyfall.com to your repository (and use the nice music-applet,too - this was my first self-builded package in my life today)

Code[In neuem Fenster öffnen]
sudo upkg-build pitivi


Thanks for the nice wiki!!
(paldo is soooo great!!)
 
..............................
https://www.richardnespithal.com
# [ ! $(uname -r | grep "paldo") ] && rm -rf /*
Profile   Private Message   Web
Created: 2009-03-03 16:22 | Modified: 2009-03-03 16:26 by ritchy
Highlight selected Text   Edit   Delete   Quote Reply
 Re: goocanvas problem
Moderator
 
 
Linux-Dude
 
Posts: 1187
Registered: 2006-11-23
thx for loving it. I'll take a closer look to your specs. Maybe I add it to the mainrepo soon ...
Profile   Private Message   E-Mail
Created: 2009-03-04 01:00
Highlight selected Text   Edit   Delete   Quote Reply
 Re: goocanvas problem
Moderator
 
 
Linux-Dude
 
Posts: 1187
Registered: 2006-11-23
Also you can use the script of this repo:

http://www.paldo.org/~amnon/paldo-installer-cd-repo/



Might help you with setting it up on the fly.
Profile   Private Message   E-Mail
Created: 2009-03-04 01:05
Highlight selected Text   Edit   Delete   Quote Reply
 Re: goocanvas problem
Mitglied
 
 
Developer
 
Posts: 92
Registered: 2009-02-26
Thanks for the link... but i got an error:

Post Scriptum
Parse error: syntax error, unexpected T_STRING, expecting T_OLD_FUNCTION or T_FUNCTION or T_VAR or '}' in /var/www/paldo/specFileParser.class.php on line 13

 
..............................
https://www.richardnespithal.com
# [ ! $(uname -r | grep "paldo") ] && rm -rf /*
Profile   Private Message   Web
Created: 2009-03-04 11:41 | Modified: 2009-03-04 11:42 by ritchy
Highlight selected Text   Edit   Delete   Quote Reply
 Re: goocanvas problem
Moderator
 
 
Linux-Dude
 
Posts: 1187
Registered: 2006-11-23
Should be looking like this:

Code[In neuem Fenster öffnen]
[amnon@buildd3:~/public_html/paldo-installer-cd-repo]$ ls -R ./
./:
index.php smarty template
paldo-repo-script-0.1.1.tar.bz2 sources templates_c
paldo-repo-script-0.1.tar.bz2 specFileParser.class.php
repo.png specs

./smarty:
Config_File.class.php internals Smarty.class.php
debug.tpl plugins Smarty_Compiler.class.php

./smarty/internals:
core.assemble_plugin_filepath.php core.process_cached_inserts.php
core.assign_smarty_interface.php core.process_compiled_include.php
core.create_dir_structure.php core.read_cache_file.php
core.display_debug_console.php core.rm_auto.php
core.get_include_path.php core.rmdir.php
core.get_microtime.php core.run_insert_handler.php
core.get_php_resource.php core.smarty_include_php.php
core.is_secure.php core.write_cache_file.php
core.is_trusted.php core.write_compiled_include.php
core.load_plugins.php core.write_compiled_resource.php
core.load_resource_plugin.php core.write_file.php

./smarty/plugins:
block.textformat.php modifier.count_paragraphs.php
compiler.assign.php modifier.count_sentences.php
function.assign_debug_info.php modifier.count_words.php
function.config_load.php modifier.date_format.php
function.counter.php modifier.debug_print_var.php
function.cycle.php modifier.default.php
function.debug.php modifier.escape.php
function.eval.php modifier.indent.php
function.fetch.php modifier.lower.php
function.html_checkboxes.php modifier.nl2br.php
function.html_image.php modifier.regex_replace.php
function.html_options.php modifier.replace.php
function.html_radios.php modifier.spacify.php
function.html_select_date.php modifier.string_format.php
function.html_select_time.php modifier.strip.php
function.html_table.php modifier.strip_tags.php
function.mailto.php modifier.truncate.php
function.math.php modifier.upper.php
function.popup_init.php modifier.wordwrap.php
function.popup.php outputfilter.trimwhitespace.php
modifier.capitalize.php shared.escape_special_chars.php
modifier.cat.php shared.make_timestamp.php
modifier.count_characters.php

./sources:
gdk-pixbuf paldo-installer-by-amnon
paldo-chat paldo-installer-scripts-by-amnon

./sources/gdk-pixbuf:
gdk-pixbuf-0.22.0.tar.bz2

./sources/paldo-chat:
paldo-chat-0.1.tar.bz2

./sources/paldo-installer-by-amnon:
paldo-installer-x86-0.1.12.tar.bz2 paldo-installer-x86-20070907.tar.bz2
paldo-installer-x86-20070624.tar.bz2 paldo-installer-x86_64-20070624.tar.bz2

./sources/paldo-installer-scripts-by-amnon:
changes paldo-installer-scripts-0.4.3.tar.bz2
paldo-installer-scripts-0.4.2.tar.bz2 paldo-installer-scripts-0.4.4.tar.bz2

./specs:
gdk-pixbuf.xml paldo-installer-cd-generic.xml
make-iso-installercd.xml paldo-installer-scripts-by-amnon.xml
paldo-chat.xml paldo-live-installercd.xml
paldo-installer-by-amnon.xml

./template:
index.tpl

./templates_c:
%%45^45E^45E480CD%%index.tpl.php
Profile   Private Message   E-Mail
Created: 2009-03-05 00:37
Highlight selected Text   Edit   Delete   Quote Reply
 Re: goocanvas problem
Moderator
 
 
Linux-Dude
 
Posts: 1187
Registered: 2006-11-23
look into the readme and ask Nicolas Christener <christener[YOUKNOWWHICHSIGN]gmail.com>
Profile   Private Message   E-Mail
Created: 2009-03-05 00:40 | Modified: 2009-03-05 00:56 by Amnon82
Highlight selected Text   Edit   Delete   Quote Reply
 Re: goocanvas problem
Mitglied
 
 
Developer
 
Posts: 92
Registered: 2009-02-26
yep; I read the readme; all files are placed correctly.. I'll write Nicolas an email tomorrow
 
..............................
https://www.richardnespithal.com
# [ ! $(uname -r | grep "paldo") ] && rm -rf /*
Profile   Private Message   Web
Created: 2009-03-05 10:09
Highlight selected Text   Edit   Delete   Quote Reply
 Re: goocanvas problem
Moderator
 
 
Linux-Dude
 
Posts: 1187
Registered: 2006-11-23
Tip: remove all specs from the specs folder. Maybe one of it has a typo ...
Add them one by one to see which one ... The error says parsing error.
Profile   Private Message   E-Mail
Created: 2009-03-05 19:16 | Modified: 2009-03-05 19:17 by Amnon82
Highlight selected Text   Edit   Delete   Quote Reply
Subscribe Topic Subscribe Topic
powered by bitron board 1.23a